domainName,registrarName,contactEmail,whoisServer,nameServers,createdDate,updatedDate,expiresDate,standardRegCreatedDate,standardRegUpdatedDate,standardRegExpiresDate,status,Audit_auditUpdatedDate,registrant_email,registrant_name,registrant_organization,registrant_street1,registrant_street2,registrant_street3,registrant_street4,registrant_city,registrant_state,registrant_postalCode,registrant_country,registrant_fax,registrant_faxExt,registrant_telephone,registrant_telephoneExt,administrativeContact_email,administrativeContact_name,administrativeContact_organization,administrativeContact_street1,administrativeContact_street2,administrativeContact_street3,administrativeContact_street4,administrativeContact_city,administrativeContact_state,administrativeContact_postalCode,administrativeContact_country,administrativeContact_fax,administrativeContact_faxExt,administrativeContact_telephone,administrativeContact_telephoneExt,billingContact_email,billingContact_name,billingContact_organization,billingContact_street1,billingContact_street2,billingContact_street3,billingContact_street4,billingContact_city,billingContact_state,billingContact_postalCode,billingContact_country,billingContact_fax,billingContact_faxExt,billingContact_telephone,billingContact_telephoneExt,technicalContact_email,technicalContact_name,technicalContact_organization,technicalContact_street1,technicalContact_street2,technicalContact_street3,technicalContact_street4,technicalContact_city,technicalContact_state,technicalContact_postalCode,technicalContact_country,technicalContact_fax,technicalContact_faxExt,technicalContact_telephone,technicalContact_telephoneExt,zoneContact_email,zoneContact_name,zoneContact_organization,zoneContact_street1,zoneContact_street2,zoneContact_street3,zoneContact_street4,zoneContact_city,zoneContact_state,zoneContact_postalCode,zoneContact_country,zoneContact_fax,zoneContact_faxExt,zoneContact_telephone,zoneContact_telephoneExt,registrarIANAID
anthonypmcoxon.info,"NameCheap, Inc",7a0674f32cf143458f2d999b88bd37f9.protect@whoisguard.com,whois.afilias.info,DNS1.REGISTRAR-SERVERS.COM|DNS2.REGISTRAR-SERVERS.COM|,2017-02-27T14:23:47Z,2017-02-27T14:23:51Z,2018-02-27T14:23:47Z,2017-02-27 14:23:47 UTC,2017-02-27 14:23:51 UTC,2018-02-27 14:23:47 UTC,clientTransferProhibited https://icann.org/epp#clientTransferProhibited|serverTransferProhibited https://icann.org/epp#serverTransferProhibited|addPeriod https://icann.org/epp#addPeriod,2017-02-28 00:00:00 UTC,7a0674f32cf143458f2d999b88bd37f9.protect@whoisguard.com,WhoisGuard Protected,"WhoisGuard, Inc.",P.O. Box 0823-03411,,,,Panama,Panama,0,PANAMA,5117057182,,5078365503,,7a0674f32cf143458f2d999b88bd37f9.protect@whoisguard.com,WhoisGuard Protected,"WhoisGuard, Inc.",P.O. Box 0823-03411,,,,Panama,Panama,0,PANAMA,5117057182,,5078365503,,7a0674f32cf143458f2d999b88bd37f9.protect@whoisguard.com,WhoisGuard Protected,"WhoisGuard, Inc.",P.O. Box 0823-03411,,,,Panama,Panama,0,PANAMA,5117057182,,5078365503,,7a0674f32cf143458f2d999b88bd37f9.protect@whoisguard.com,WhoisGuard Protected,"WhoisGuard, Inc.",P.O. Box 0823-03411,,,,Panama,Panama,0,PANAMA,5117057182,,5078365503,,,,,,,,,,,,,,,,,1068
abccab.info,Nhan Hoa Software Company Ltd.,tahuuha@gmail.com,whois.afilias.info,NS1.ZONEDNS.VN|NS2.ZONEDNS.VN|NS3.ZONEDNS.VN|NS4.ZONEDNS.VN|,2017-02-28T05:24:52Z,2017-02-28T05:24:54Z,2018-02-28T05:24:52Z,2017-02-28 05:24:52 UTC,2017-02-28 05:24:54 UTC,2018-02-28 05:24:52 UTC,clientTransferProhibited https://icann.org/epp#clientTransferProhibited|serverTransferProhibited https://icann.org/epp#serverTransferProhibited|addPeriod https://icann.org/epp#addPeriod,2017-02-28 00:00:00 UTC,tahuuha@gmail.com,Ta Huu Ha,None,"CT12C Kim Van Kim Lu, Dai Kim, Hoang Mai, Ha Noi",,,,Ha Noi,,10000,VIETNAM,,,84985692797,,tahuuha@gmail.com,Ta Huu Ha,None,"CT12C Kim Van Kim Lu, Dai Kim, Hoang Mai, Ha Noi",,,,Ha Noi,,10000,VIETNAM,,,84985692797,,tahuuha@gmail.com,Ta Huu Ha,None,"CT12C Kim Van Kim Lu, Dai Kim, Hoang Mai, Ha Noi",,,,Ha Noi,,10000,VIETNAM,,,84985692797,,tahuuha@gmail.com,Ta Huu Ha,None,"CT12C Kim Van Kim Lu, Dai Kim, Hoang Mai, Ha Noi",,,,Ha Noi,,10000,VIETNAM,,,84985692797,,,,,,,,,,,,,,,,,1710
animers.info,"Namesilo, LLC",crosslifeover@gmail.com,whois.afilias.info,NS3.DNSOWL.COM|NS1.DNSOWL.COM|NS2.DNSOWL.COM|,2017-02-27T09:37:36Z,2017-02-27T09:37:36Z,2018-02-27T09:37:36Z,2017-02-27 09:37:36 UTC,2017-02-27 09:37:36 UTC,2018-02-27 09:37:36 UTC,clientDeleteProhibited https://icann.org/epp#clientDeleteProhibited|clientRenewProhibited https://icann.org/epp#clientRenewProhibited|clientTransferProhibited https://icann.org/epp#clientTransferProhibited|clientUpdateProhibited https://icann.org/epp#clientUpdateProhibited|serverTransferProhibited https://icann.org/epp#serverTransferProhibited|addPeriod https://icann.org/epp#addPeriod,2017-02-28 00:00:00 UTC,crosslifeover@gmail.com,cross life,crosslife,pemuda,,,,medan,sumatera utara,28141,INDONESIA,,,6285230029119,,crosslifeover@gmail.com,cross life,crosslife,pemuda,,,,medan,sumatera utara,28141,INDONESIA,,,6285230029119,,crosslifeover@gmail.com,cross life,crosslife,pemuda,,,,medan,sumatera utara,28141,INDONESIA,,,6285230029119,,crosslifeover@gmail.com,cross life,crosslife,pemuda,,,,medan,sumatera utara,28141,INDONESIA,,,6285230029119,,,,,,,,,,,,,,,,,1479
appleseedadventures.info,"GoDaddy.com, LLC",lcorydonap@aol.com,whois.godaddy.com,NS47.DOMAINCONTROL.COM|NS48.DOMAINCONTROL.COM|,2017-02-27T17:36:07Z,2017-02-27T17:36:08Z,2018-02-27T17:36:07Z,2017-02-27 17:36:07 UTC,2017-02-27 17:36:08 UTC,2018-02-27 17:36:07 UTC,clientDeleteProhibited https://icann.org/epp#clientDeleteProhibited|clientRenewProhibited https://icann.org/epp#clientRenewProhibited|clientTransferProhibited https://icann.org/epp#clientTransferProhibited|clientUpdateProhibited https://icann.org/epp#clientUpdateProhibited|serverTransferProhibited https://icann.org/epp#serverTransferProhibited|addPeriod https://icann.org/epp#addPeriod,2017-02-28 00:00:00 UTC,lcorydonap@aol.com,Libby Corydon-Apicella,,151 Lorraine Drive,,,,Berkeley Heights,New Jersey,7922,UNITED STATES,,,19082656725,,lcorydonap@aol.com,Libby Corydon-Apicella,,151 Lorraine Drive,,,,Berkeley Heights,New Jersey,7922,UNITED STATES,,,19082656725,,lcorydonap@aol.com,Libby Corydon-Apicella,,151 Lorraine Drive,,,,Berkeley Heights,New Jersey,7922,UNITED STATES,,,19082656725,,lcorydonap@aol.com,Libby Corydon-Apicella,,151 Lorraine Drive,,,,Berkeley Heights,New Jersey,7922,UNITED STATES,,,19082656725,,,,,,,,,,,,,,,,,146
appareil-photo-compact.info,Internet Domain Service BS Corp,appareil-photo-compact.info-owner-lukl@customers.whoisprivacycorp.com,whois.afilias.info,NS1.O2SWITCH.NET|NS2.O2SWITCH.NET|,2017-02-27T10:20:51Z,2017-02-27T10:20:52Z,2018-02-27T10:20:51Z,2017-02-27 10:20:51 UTC,2017-02-27 10:20:52 UTC,2018-02-27 10:20:51 UTC,clientTransferProhibited https://icann.org/epp#clientTransferProhibited|serverTransferProhibited https://icann.org/epp#serverTransferProhibited|addPeriod https://icann.org/epp#addPeriod,2017-02-28 00:00:00 UTC,appareil-photo-compact.info-owner-lukl@customers.whoisprivacycorp.com,Domain Admin,Whois Privacy Corp.,"Ocean Centre, Montagu Foreshore|East Bay Street",,,,Nassau,New Providence,N/A,BAHAMAS,,,15163872248,,appareil-photo-compact.info-admin-fmar@customers.whoisprivacycorp.com,Domain Admin,Whois Privacy Corp.,"Ocean Centre, Montagu Foreshore|East Bay Street",,,,Nassau,New Providence,N/A,BAHAMAS,,,15163872248,,appareil-photo-compact.info-bill-73sz@customers.whoisprivacycorp.com,Domain Admin,Whois Privacy Corp.,"Ocean Centre, Montagu Foreshore|East Bay Street",,,,Nassau,New Providence,N/A,BAHAMAS,,,15163872248,,appareil-photo-compact.info-tech-lyja@customers.whoisprivacycorp.com,Domain Admin,Whois Privacy Corp.,"Ocean Centre, Montagu Foreshore|East Bay Street",,,,Nassau,New Providence,N/A,BAHAMAS,,,15163872248,,,,,,,,,,,,,,,,,2487
allsexgames.info,"NameCheap, Inc",93721576866b441a8b0435a481476a62.protect@whoisguard.com,whois.afilias.info,NS1.AH-DNS.COM|NS2.AH-DNS.COM|,2017-02-28T06:57:54Z,2017-02-28T12:44:43Z,2018-02-28T06:57:54Z,2017-02-28 06:57:54 UTC,2017-02-28 12:44:43 UTC,2018-02-28 06:57:54 UTC,clientTransferProhibited https://icann.org/epp#clientTransferProhibited|serverTransferProhibited https://icann.org/epp#serverTransferProhibited|addPeriod https://icann.org/epp#addPeriod,2017-02-28 00:00:00 UTC,93721576866b441a8b0435a481476a62.protect@whoisguard.com,WhoisGuard Protected,"WhoisGuard, Inc.",P.O. Box 0823-03411,,,,Panama,Panama,0,PANAMA,5117057182,,5078365503,,93721576866b441a8b0435a481476a62.protect@whoisguard.com,WhoisGuard Protected,"WhoisGuard, Inc.",P.O. Box 0823-03411,,,,Panama,Panama,0,PANAMA,5117057182,,5078365503,,93721576866b441a8b0435a481476a62.protect@whoisguard.com,WhoisGuard Protected,"WhoisGuard, Inc.",P.O. Box 0823-03411,,,,Panama,Panama,0,PANAMA,5117057182,,5078365503,,93721576866b441a8b0435a481476a62.protect@whoisguard.com,WhoisGuard Protected,"WhoisGuard, Inc.",P.O. Box 0823-03411,,,,Panama,Panama,0,PANAMA,5117057182,,5078365503,,,,,,,,,,,,,,,,,1068
agprojectsme.info,"GoDaddy.com, LLC",agprojectsme.info@domainsbyproxy.com,whois.godaddy.com,NS47.DOMAINCONTROL.COM|NS48.DOMAINCONTROL.COM|,2017-02-28T07:37:06Z,2017-02-28T07:37:07Z,2019-02-28T07:37:06Z,2017-02-28 07:37:06 UTC,2017-02-28 07:37:07 UTC,2019-02-28 07:37:06 UTC,clientDeleteProhibited https://icann.org/epp#clientDeleteProhibited|clientRenewProhibited https://icann.org/epp#clientRenewProhibited|clientTransferProhibited https://icann.org/epp#clientTransferProhibited|clientUpdateProhibited https://icann.org/epp#clientUpdateProhibited|serverTransferProhibited https://icann.org/epp#serverTransferProhibited|addPeriod https://icann.org/epp#addPeriod,2017-02-28 00:00:00 UTC,agprojectsme.info@domainsbyproxy.com,Registration Private,"Domains By Proxy, LLC",DomainsByProxy.com|14455 N. Hayden Road,,,,Scottsdale,Arizona,85260,UNITED STATES,14806242598,,14806242599,,agprojectsme.info@domainsbyproxy.com,Registration Private,"Domains By Proxy, LLC",DomainsByProxy.com|14455 N. Hayden Road,,,,Scottsdale,Arizona,85260,UNITED STATES,14806242598,,14806242599,,agprojectsme.info@domainsbyproxy.com,Registration Private,"Domains By Proxy, LLC",DomainsByProxy.com|14455 N. Hayden Road,,,,Scottsdale,Arizona,85260,UNITED STATES,14806242598,,14806242599,,agprojectsme.info@domainsbyproxy.com,Registration Private,"Domains By Proxy, LLC",DomainsByProxy.com|14455 N. Hayden Road,,,,Scottsdale,Arizona,85260,UNITED STATES,14806242598,,14806242599,,,,,,,,,,,,,,,,,146
actressimages.info,"NameCheap, Inc",d843e8da47a94a4296673f5f8b31ffe0.protect@whoisguard.com,whois.afilias.info,DNS1.REGISTRAR-SERVERS.COM|DNS2.REGISTRAR-SERVERS.COM|,2017-02-27T15:07:25Z,2017-02-27T15:08:02Z,2018-02-27T15:07:25Z,2017-02-27 15:07:25 UTC,2017-02-27 15:08:02 UTC,2018-02-27 15:07:25 UTC,clientTransferProhibited https://icann.org/epp#clientTransferProhibited|serverTransferProhibited https://icann.org/epp#serverTransferProhibited|addPeriod https://icann.org/epp#addPeriod,2017-02-28 00:00:00 UTC,d843e8da47a94a4296673f5f8b31ffe0.protect@whoisguard.com,WhoisGuard Protected,"WhoisGuard, Inc.",P.O. Box 0823-03411,,,,Panama,Panama,0,PANAMA,5117057182,,5078365503,,d843e8da47a94a4296673f5f8b31ffe0.protect@whoisguard.com,WhoisGuard Protected,"WhoisGuard, Inc.",P.O. Box 0823-03411,,,,Panama,Panama,0,PANAMA,5117057182,,5078365503,,d843e8da47a94a4296673f5f8b31ffe0.protect@whoisguard.com,WhoisGuard Protected,"WhoisGuard, Inc.",P.O. Box 0823-03411,,,,Panama,Panama,0,PANAMA,5117057182,,5078365503,,d843e8da47a94a4296673f5f8b31ffe0.protect@whoisguard.com,WhoisGuard Protected,"WhoisGuard, Inc.",P.O. Box 0823-03411,,,,Panama,Panama,0,PANAMA,5117057182,,5078365503,,,,,,,,,,,,,,,,,1068
athenos.info,"Network Solutions, LLC",kx3af82s5qm@networksolutionsprivateregistration.com,whois.afilias.info,NS87.WORLDNIC.COM|NS88.WORLDNIC.COM|,2017-02-28T00:14:05Z,2017-02-28T00:15:34Z,2018-02-28T00:14:05Z,2017-02-28 00:14:05 UTC,2017-02-28 00:15:34 UTC,2018-02-28 00:14:05 UTC,clientTransferProhibited https://icann.org/epp#clientTransferProhibited|serverTransferProhibited https://icann.org/epp#serverTransferProhibited|addPeriod https://icann.org/epp#addPeriod,2017-02-28 00:00:00 UTC,kx3af82s5qm@networksolutionsprivateregistration.com,"PERFECT PRIVACY, LLC",,12808 Gran Bay Parkway West|care of Network Solutions|PO Box 459,,,,Jacksonville,FL,32258,UNITED STATES,,,15707088780,,ys29y8ch5j6@networksolutionsprivateregistration.com,"PERFECT PRIVACY, LLC",,12808 Gran Bay Parkway West|care of Network Solutions|PO Box 459,,,,Jacksonville,FL,32258,UNITED STATES,,,15707088780,,ys29y8ch5j6@networksolutionsprivateregistration.com,"PERFECT PRIVACY, LLC",,12808 Gran Bay Parkway West|care of Network Solutions|PO Box 459,,,,Jacksonville,FL,32258,UNITED STATES,,,15707088780,,ys29y8ch5j6@networksolutionsprivateregistration.com,"PERFECT PRIVACY, LLC",,12808 Gran Bay Parkway West|care of Network Solutions|PO Box 459,,,,Jacksonville,FL,32258,UNITED STATES,,,15707088780,,,,,,,,,,,,,,,,,2
arenda-ofisov.info,"Limited Liability Company ""Registrar of domain names REG.RU""",arenda-ofisov.info@regprivate.ru,whois.afilias.info,NS1.REG.RU|NS2.REG.RU|,2017-02-27T08:55:12Z,2017-02-27T08:55:14Z,2018-02-27T08:55:12Z,2017-02-27 08:55:12 UTC,2017-02-27 08:55:14 UTC,2018-02-27 08:55:12 UTC,clientTransferProhibited https://icann.org/epp#clientTransferProhibited|serverTransferProhibited https://icann.org/epp#serverTransferProhibited|addPeriod https://icann.org/epp#addPeriod,2017-02-28 00:00:00 UTC,arenda-ofisov.info@regprivate.ru,Protection of Private Person,Privacy Protection,"PO box 87, REG.RU Protection Service",,,,Moscow,,123007,RUSSIAN FEDERATION,74955801111,,74955801111,,arenda-ofisov.info@regprivate.ru,Protection of Private Person,Privacy Protection,"PO box 87, REG.RU Protection Service",,,,Moscow,,123007,RUSSIAN FEDERATION,74955801111,,74955801111,,arenda-ofisov.info@regprivate.ru,Protection of Private Person,Privacy Protection,"PO box 87, REG.RU Protection Service",,,,Moscow,,123007,RUSSIAN FEDERATION,74955801111,,74955801111,,arenda-ofisov.info@regprivate.ru,Protection of Private Person,Privacy Protection,"PO box 87, REG.RU Protection Service",,,,Moscow,,123007,RUSSIAN FEDERATION,74955801111,,74955801111,,,,,,,,,,,,,,,,,1606
alloutbaseball.info,"GoDaddy.com, LLC",alis1522@yahoo.com,whois.godaddy.com,NS47.DOMAINCONTROL.COM|NS48.DOMAINCONTROL.COM|,2017-02-28T02:01:33Z,2017-02-28T02:01:33Z,2018-02-28T02:01:33Z,2017-02-28 02:01:33 UTC,2017-02-28 02:01:33 UTC,2018-02-28 02:01:33 UTC,clientDeleteProhibited https://icann.org/epp#clientDeleteProhibited|clientRenewProhibited https://icann.org/epp#clientRenewProhibited|clientTransferProhibited https://icann.org/epp#clientTransferProhibited|clientUpdateProhibited https://icann.org/epp#clientUpdateProhibited|serverTransferProhibited https://icann.org/epp#serverTransferProhibited|addPeriod https://icann.org/epp#addPeriod,2017-02-28 00:00:00 UTC,alis1522@yahoo.com,Alissa Villegas,,2512 Digger Lane,,,,Corpus Christi,Texas,78415,UNITED STATES,,,13617746638,,alis1522@yahoo.com,Alissa Villegas,,2512 Digger Lane,,,,Corpus Christi,Texas,78415,UNITED STATES,,,13617746638,,alis1522@yahoo.com,Alissa Villegas,,2512 Digger Lane,,,,Corpus Christi,Texas,78415,UNITED STATES,,,13617746638,,alis1522@yahoo.com,Alissa Villegas,,2512 Digger Lane,,,,Corpus Christi,Texas,78415,UNITED STATES,,,13617746638,,,,,,,,,,,,,,,,,146
altituderevenuedevelopment.info,"GoDaddy.com, LLC",srl.frontrange@gmail.com,whois.godaddy.com,NS47.DOMAINCONTROL.COM|NS48.DOMAINCONTROL.COM|,2017-02-27T13:29:57Z,2017-02-27T20:51:36Z,2018-02-27T13:29:57Z,2017-02-27 13:29:57 UTC,2017-02-27 20:51:36 UTC,2018-02-27 13:29:57 UTC,clientDeleteProhibited https://icann.org/epp#clientDeleteProhibited|clientRenewProhibited https://icann.org/epp#clientRenewProhibited|clientTransferProhibited https://icann.org/epp#clientTransferProhibited|clientUpdateProhibited https://icann.org/epp#clientUpdateProhibited|serverTransferProhibited https://icann.org/epp#serverTransferProhibited|addPeriod https://icann.org/epp#addPeriod,2017-02-28 00:00:00 UTC,srl.frontrange@gmail.com,Shawna Lytle,,2725 Nightstar Ct,,,,Colorado Springs,Colorado,80907,UNITED STATES,,,17193583228,,srl.frontrange@gmail.com,Shawna Lytle,,2725 Nightstar Ct,,,,Colorado Springs,Colorado,80907,UNITED STATES,,,17193583228,,srl.frontrange@gmail.com,Shawna Lytle,,2725 Nightstar Ct,,,,Colorado Springs,Colorado,80907,UNITED STATES,,,17193583228,,srl.frontrange@gmail.com,Shawna Lytle,,2725 Nightstar Ct,,,,Colorado Springs,Colorado,80907,UNITED STATES,,,17193583228,,,,,,,,,,,,,,,,,146
adolfbooks.info,"NameCheap, Inc",57cd30971736436294c1bffb865277ba.protect@whoisguard.com,whois.afilias.info,ARA.NS.CLOUDFLARE.COM|KEVIN.NS.CLOUDFLARE.COM|,2017-02-28T08:20:59Z,2017-02-28T10:44:58Z,2018-02-28T08:20:59Z,2017-02-28 08:20:59 UTC,2017-02-28 10:44:58 UTC,2018-02-28 08:20:59 UTC,clientTransferProhibited https://icann.org/epp#clientTransferProhibited|serverTransferProhibited https://icann.org/epp#serverTransferProhibited|addPeriod https://icann.org/epp#addPeriod,2017-02-28 00:00:00 UTC,57cd30971736436294c1bffb865277ba.protect@whoisguard.com,WhoisGuard Protected,"WhoisGuard, Inc.",P.O. Box 0823-03411,,,,Panama,Panama,0,PANAMA,5117057182,,5078365503,,57cd30971736436294c1bffb865277ba.protect@whoisguard.com,WhoisGuard Protected,"WhoisGuard, Inc.",P.O. Box 0823-03411,,,,Panama,Panama,0,PANAMA,5117057182,,5078365503,,57cd30971736436294c1bffb865277ba.protect@whoisguard.com,WhoisGuard Protected,"WhoisGuard, Inc.",P.O. Box 0823-03411,,,,Panama,Panama,0,PANAMA,5117057182,,5078365503,,57cd30971736436294c1bffb865277ba.protect@whoisguard.com,WhoisGuard Protected,"WhoisGuard, Inc.",P.O. Box 0823-03411,,,,Panama,Panama,0,PANAMA,5117057182,,5078365503,,,,,,,,,,,,,,,,,1068
aishacahn.info,"NameCheap, Inc",699427dcd5184f46a20391ed962d9c27.protect@whoisguard.com,whois.afilias.info,NS1.OPENSPACEADVERTISINGLTD.COM|NS2.OPENSPACEADVERTISINGLTD.COM|,2017-02-27T15:13:21Z,2017-02-27T15:13:24Z,2018-02-27T15:13:21Z,2017-02-27 15:13:21 UTC,2017-02-27 15:13:24 UTC,2018-02-27 15:13:21 UTC,clientTransferProhibited https://icann.org/epp#clientTransferProhibited|serverTransferProhibited https://icann.org/epp#serverTransferProhibited|addPeriod https://icann.org/epp#addPeriod,2017-02-28 00:00:00 UTC,699427dcd5184f46a20391ed962d9c27.protect@whoisguard.com,WhoisGuard Protected,"WhoisGuard, Inc.",P.O. Box 0823-03411,,,,Panama,Panama,0,PANAMA,5117057182,,5078365503,,699427dcd5184f46a20391ed962d9c27.protect@whoisguard.com,WhoisGuard Protected,"WhoisGuard, Inc.",P.O. Box 0823-03411,,,,Panama,Panama,0,PANAMA,5117057182,,5078365503,,699427dcd5184f46a20391ed962d9c27.protect@whoisguard.com,WhoisGuard Protected,"WhoisGuard, Inc.",P.O. Box 0823-03411,,,,Panama,Panama,0,PANAMA,5117057182,,5078365503,,699427dcd5184f46a20391ed962d9c27.protect@whoisguard.com,WhoisGuard Protected,"WhoisGuard, Inc.",P.O. Box 0823-03411,,,,Panama,Panama,0,PANAMA,5117057182,,5078365503,,,,,,,,,,,,,,,,,1068
abintus.info,Key-Systems GmbH,webznederland@gmail.com,whois.afilias.info,DNS01.2UHOSTING.NL|DNS02.2UHOSTING.NL|,2017-02-27T15:58:04Z,,2018-02-27T15:58:04Z,2017-02-27 15:58:04 UTC,,2018-02-27 15:58:04 UTC,serverTransferProhibited https://icann.org/epp#serverTransferProhibited|addPeriod https://icann.org/epp#addPeriod,2017-02-28 00:00:00 UTC,webznederland@gmail.com,s unett,,Kraneweg 10e,,,,Groningen,,9718JP,NETHERLANDS,,,31123456789,,webznederland@gmail.com,s unett,,Kraneweg 10e,,,,Groningen,,9718JP,NETHERLANDS,,,31123456789,,webznederland@gmail.com,s unett,,Kraneweg 10e,,,,Groningen,,9718JP,NETHERLANDS,,,31123456789,,webznederland@gmail.com,s unett,,Kraneweg 10e,,,,Groningen,,9718JP,NETHERLANDS,,,31123456789,,,,,,,,,,,,,,,,,269
aaronmangal.info,"GoDaddy.com, LLC",aaron.mangal1985@gmail.com,whois.godaddy.com,NS47.DOMAINCONTROL.COM|NS48.DOMAINCONTROL.COM|,2017-02-28T00:46:27Z,2017-02-28T00:46:28Z,2018-02-28T00:46:27Z,2017-02-28 00:46:27 UTC,2017-02-28 00:46:28 UTC,2018-02-28 00:46:27 UTC,clientDeleteProhibited https://icann.org/epp#clientDeleteProhibited|clientRenewProhibited https://icann.org/epp#clientRenewProhibited|clientTransferProhibited https://icann.org/epp#clientTransferProhibited|clientUpdateProhibited https://icann.org/epp#clientUpdateProhibited|serverTransferProhibited https://icann.org/epp#serverTransferProhibited|addPeriod https://icann.org/epp#addPeriod,2017-02-28 00:00:00 UTC,aaron.mangal1985@gmail.com,Aaron Mangal,,5439 Strand,,,,Hawthorne,California,90250,UNITED STATES,,,14242557930,,aaron.mangal1985@gmail.com,Aaron Mangal,,5439 Strand,,,,Hawthorne,California,90250,UNITED STATES,,,14242557930,,aaron.mangal1985@gmail.com,Aaron Mangal,,5439 Strand,,,,Hawthorne,California,90250,UNITED STATES,,,14242557930,,aaron.mangal1985@gmail.com,Aaron Mangal,,5439 Strand,,,,Hawthorne,California,90250,UNITED STATES,,,14242557930,,,,,,,,,,,,,,,,,146
aut-verifed-account.info,"DomainPeople, Inc.",carolchorette@outlook.com,whois.afilias.info,ADNS.CS.SITEPROTECT.COM|BDNS.CS.SITEPROTECT.COM|,2017-02-28T01:19:13Z,2017-02-28T01:19:14Z,2018-02-28T01:19:13Z,2017-02-28 01:19:13 UTC,2017-02-28 01:19:14 UTC,2018-02-28 01:19:13 UTC,clientTransferProhibited https://icann.org/epp#clientTransferProhibited|serverTransferProhibited https://icann.org/epp#serverTransferProhibited|addPeriod https://icann.org/epp#addPeriod,2017-02-28 00:00:00 UTC,carolchorette@outlook.com,Kayla Hill,Kayla Hill,433 Stonebridge Circle,,,,Savannah,GA,31419,UNITED STATES,,,18023426021,,carolchorette@outlook.com,Kayla Hill,Kayla Hill,433 Stonebridge Circle,,,,Savannah,GA,31419,UNITED STATES,,,18023426021,,carolchorette@outlook.com,Kayla Hill,Kayla Hill,433 Stonebridge Circle,,,,Savannah,GA,31419,UNITED STATES,,,18023426021,,carolchorette@outlook.com,Kayla Hill,Kayla Hill,433 Stonebridge Circle,,,,Savannah,GA,31419,UNITED STATES,,,18023426021,,,,,,,,,,,,,,,,,65
appleaccount-disable.info,Tucows Domains Inc.,appleaccount-disable.info@contactprivacy.com,whois.afilias.info,DNS1.P01.NSONE.NET|DNS2.P01.NSONE.NET|DNS3.P01.NSONE.NET|DNS4.P01.NSONE.NET|,2017-02-27T16:08:54Z,2017-02-27T16:08:55Z,2018-02-27T16:08:54Z,2017-02-27 16:08:54 UTC,2017-02-27 16:08:55 UTC,2018-02-27 16:08:54 UTC,clientTransferProhibited https://icann.org/epp#clientTransferProhibited|clientUpdateProhibited https://icann.org/epp#clientUpdateProhibited|serverTransferProhibited https://icann.org/epp#serverTransferProhibited|addPeriod https://icann.org/epp#addPeriod,2017-02-28 00:00:00 UTC,appleaccount-disable.info@contactprivacy.com,Contact Privacy Inc. Customer 0147559069,Contact Privacy Inc. Customer 0147559069,96 Mowat Ave,,,,Toronto,ON,M6K 3M1,CANADA,,,14165385457,,appleaccount-disable.info@contactprivacy.com,Contact Privacy Inc. Customer 0147559069,Contact Privacy Inc. Customer 0147559069,96 Mowat Ave,,,,Toronto,ON,M6K 3M1,CANADA,,,14165385457,,appleaccount-disable.info@contactprivacy.com,Contact Privacy Inc. Customer 0147559069,Contact Privacy Inc. Customer 0147559069,96 Mowat Ave,,,,Toronto,ON,M6K 3M1,CANADA,,,14165385457,,appleaccount-disable.info@contactprivacy.com,Contact Privacy Inc. Customer 0147559069,Contact Privacy Inc. Customer 0147559069,96 Mowat Ave,,,,Toronto,ON,M6K 3M1,CANADA,,,14165385457,,,,,,,,,,,,,,,,,69